{"text_format":"1","workbook":"xlsx","n_sheets":7,"sheets":["Data Inputs","Assumptions & Relationships","Risk Measures","Loan and Cash Flow Accounts","Income Statements","Balance Sheets","Capital"],"not_rendered":{"charts":3,"images":6,"macros":1,"external_links":0,"defined_names":95,"comments":2,"pivot_tables":0},"unopened":[],"bounds":{"document_bytes":16777216,"sheet_cells":100000,"rows_first":2000,"rows_last":500,"rows_between":2000,"halvings":0,"cell_chars":16384,"cell_head_chars":4096},"cells_cut":0,"cells_raw":0,"read":"whole","date_system":"1900"}

{"sheet":"Data Inputs","index":0,"n_rows":586,"n_cols":79,"rows_kept":586,"cut":false,"hidden":false,"merged":[]}
[null,null,"This sheet contains: Balance Sheet, income statement, loan data, interest rate shock results, 10-year MT, and other data needed to run the test.",null,null,null,null,null,null,null,null,null,null,null,null,null,null,null,null,null,null,null,null,null,null,null,null,null,null,null,null,null,null,null,null,null,null,null,null,null,null,null,null,null,null,null,null,null,"This Sheet is for convenience of transfer into the data tab of the RBCST.  Check formats each time to insure correspondance."]
[null,null,"Instructions: Enter information in areas marked in blue.",null,null,null,null,null,null,null,null,null,null,null,null,null,null,null,null,null,null,null,null,null,null,null,null,null,null,null,null,null,null,null,null,null,null,null,null,null,null,null,null,null,null,null,null,null,"(Convenient to use paste special  | skip blanks to collate information)"]
[null,null,null,1,2,3,4,5,6,7,8,9,10,11,12,13,14,15,16,17,18,19,20,21,22,23,24,25,26,27,28,29,30,31,32,33,34,35,36,37,38,39,40,41,42,43,44,45,46,47,48,49,50,51,52,53,54,55,56,57,58,59,60,61,62,63,64,65,66,67,68,69,70,71,72,73,74,75,76]
["Date Range",{"$f":"Asofdate","v":"2018-03-31"},null,"1999-06-30","1999-09-30","1999-12-31","2000-03-31","2000-06-30","2000-09-30","2000-12-31","2001-03-31","2001-06-30","2001-09-30","2001-12-31","2002-03-31","2002-06-30","2002-09-30","2002-12-31","2003-03-31","2003-06-30","2003-09-30","2003-12-31","2004-03-31","2004-06-30","2004-09-30","2004-12-31","2005-03-31","2005-06-30","2005-09-30","2005-12-31","2006-03-31","2006-06-30","2006-09-30","2006-12-31","2007-03-31","2007-06-30","2007-09-30","2007-12-31","2008-03-31","2008-06-30","2008-09-30","2008-12-31","2009-03-31","2009-06-30","2009-09-30","2009-12-31","2010-03-31","2010-06-30","2010-09-30","2010-12-31","2011-03-31","2011-06-30","2011-09-30","2011-12-31","2012-03-31","2012-06-30","2012-09-30","2012-12-31","2013-03-31","2013-06-30","2013-09-30","2013-12-31","2014-03-31","2014-06-30","2014-09-30","2014-12-31","2015-03-31","2015-06-30","2015-09-30","2015-12-31","2016-03-31","2016-06-30","2016-09-30","2016-12-31","2017-03-31","2017-06-30","2017-09-30","2017-12-31","2018-03-31"]
[null,null,"Balance Sheet"]
[null,null,"Assets:"]
[null,{"$f":"LOOKUP($B$4,$D$4:$CD$4,D7:CD7)","v":0},"Cash and cash equivalents"]
[null,{"$f":"LOOKUP($B$4,$D$4:$CD$4,D8:CD8)","v":0},"Investment Securities "]
{"$rows_left_out":579}
{"sheet":"Assumptions & Relationships","index":1,"n_rows":145,"n_cols":13,"rows_kept":145,"cut":false,"hidden":false,"merged":[[72,1,72,5]]}
["This sheet contains: amortization and prepayment assumptions, other balance sheet assumptions, income and expense assumptions, off-balance sheet income assumptions, credit loss,  cost and earnings rate parameters, and interest rate model selection.",null,"This sheet contains: Balance Sheet, income statement, loan data, interest rate shock results, 10-year MT, and other data needed to run the test."]
["Instructions: Enter information in areas marked in blue."]
[]
[]
["Analysis Date:",{"$f":"Capital!A5","v":"2018-03-31"}]
[]
[]
["Amortization and Prepayment Assumptions"]
{"$rows_left_out":138}
{"sheet":"Risk Measures","index":2,"n_rows":290,"n_cols":54,"rows_kept":290,"cut":false,"hidden":false,"merged":[]}
["This sheet contains: Interest rate environment and credit loss results"]
["Instructions: Enter information in areas marked in blue."]
[]
[]
[]
["Interest Rate Environment "]
[null,"Time Period","t0","t1","t2","t3","t4","t5","t6","t7","t8","t9","t10"]
[null,"Rate ",{"$f":"CHOOSE('Assumptions & Relationships'!$B$128,D19,E19,F19,G19)","v":0},{"$f":"CHOOSE(rcase,D20,E20,F20,G20)","v":0},{"$f":"CHOOSE(rcase,D21,E21,F21,G21)","v":0},{"$f":"CHOOSE(rcase,D22,E22,F22,G22)","v":0},{"$f":"CHOOSE(rcase,D23,E23,F23,G23)","v":0},{"$f":"CHOOSE(rcase,D24,E24,F24,G24)","v":0},{"$f":"CHOOSE(rcase,D25,E25,F25,G25)","v":0},{"$f":"CHOOSE(rcase,D26,E26,F26,G26)","v":0},{"$f":"CHOOSE(rcase,D27,E27,F27,G27)","v":0},{"$f":"CHOOSE(rcase,D28,E28,F28,G28)","v":0},{"$f":"CHOOSE(rcase,D29,E29,F29,G29)","v":0}]
{"$rows_left_out":283}
{"sheet":"Loan and Cash Flow Accounts","index":3,"n_rows":206,"n_cols":12,"rows_kept":206,"cut":false,"hidden":false,"merged":[[36,2,36,11]]}
["This sheet contains: Geographic distribution of loan volume, asset/liability compositions, and cash flow accounts"]
["Instructions: None -- Sheet is computational."]
[]
[]
["Asset and Liability Compositions"]
[null,"Fraction of "]
["Assets:","Loans and Investments"]
["Cash and cash equivalents",{"$f":"(B42+B47)/(B42+B47+B52+B57+B62+B67+B73+B78+B83+B87+B92+B97)","v":{"$error":"#DIV/0!"}}]
{"$rows_left_out":199}
{"sheet":"Income Statements","index":4,"n_rows":86,"n_cols":12,"rows_kept":86,"cut":false,"hidden":false,"merged":[[3,2,3,11]]}
["This sheet contains: Abbreviated income statement"]
["Instructions: None -- Sheet is computational."]
[]
[null,null,"Proforma Income Statements"]
[null,null,{"$f":"CONCATENATE(MONTH('Balance Sheets'!B5),\"/\",YEAR('Balance Sheets'!B5),\" to \",MONTH('Balance Sheets'!C5),\"/\",YEAR('Balance Sheets'!C5))","v":"3/2018 to 3/2019"},{"$f":"CONCATENATE(MONTH('Balance Sheets'!C5),\"/\",YEAR('Balance Sheets'!C5),\" to \",MONTH('Balance Sheets'!D5),\"/\",YEAR('Balance Sheets'!D5))","v":"3/2019 to 3/2020"},{"$f":"CONCATENATE(MONTH('Balance Sheets'!D5),\"/\",YEAR('Balance Sheets'!D5),\" to \",MONTH('Balance Sheets'!E5),\"/\",YEAR('Balance Sheets'!E5))","v":"3/2020 to 3/2021"},{"$f":"CONCATENATE(MONTH('Balance Sheets'!E5),\"/\",YEAR('Balance Sheets'!E5),\" to \",MONTH('Balance Sheets'!F5),\"/\",YEAR('Balance Sheets'!F5))","v":"3/2021 to 3/2022"},{"$f":"CONCATENATE(MONTH('Balance Sheets'!F5),\"/\",YEAR('Balance Sheets'!F5),\" to \",MONTH('Balance Sheets'!G5),\"/\",YEAR('Balance Sheets'!G5))","v":"3/2022 to 3/2023"},{"$f":"CONCATENATE(MONTH('Balance Sheets'!G5),\"/\",YEAR('Balance Sheets'!G5),\" to \",MONTH('Balance Sheets'!H5),\"/\",YEAR('Balance Sheets'!H5))","v":"3/2023 to 3/2024"},{"$f":"CONCATENATE(MONTH('Balance Sheets'!H5),\"/\",YEAR('Balance Sheets'!H5),\" to \",MONTH('Balance Sheets'!I5),\"/\",YEAR('Balance Sheets'!I5))","v":"3/2024 to 3/2025"},{"$f":"CONCATENATE(MONTH('Balance Sheets'!I5),\"/\",YEAR('Balance Sheets'!I5),\" to \",MONTH('Balance Sheets'!J5),\"/\",YEAR('Balance Sheets'!J5))","v":"3/2025 to 3/2026"},{"$f":"CONCATENATE(MONTH('Balance Sheets'!J5),\"/\",YEAR('Balance Sheets'!J5),\" to \",MONTH('Balance Sheets'!K5),\"/\",YEAR('Balance Sheets'!K5))","v":"3/2026 to 3/2027"},{"$f":"CONCATENATE(MONTH('Balance Sheets'!K5),\"/\",YEAR('Balance Sheets'!K5),\" to \",MONTH('Balance Sheets'!L5),\"/\",YEAR('Balance Sheets'!L5))","v":"3/2027 to 3/2028"}]
[null,null,"t0","t1","t2","t3","t4","t5","t6","t7","t8","t9"]
["Sources:",null,"t1","t2","t3","t4","t5","t6","t7","t8","t9","t10"]
["Interest earnings:"]
{"$rows_left_out":79}
{"sheet":"Balance Sheets","index":5,"n_rows":64,"n_cols":15,"rows_kept":64,"cut":false,"hidden":false,"merged":[[3,2,3,11]]}
["This sheet contains:  Balance sheet information"]
["Instructions: None -- Sheet is computational."]
[]
[null,"Initial Balances","Proforma Balance Sheets on Annual Bases"]
[null,{"$f":"'Data Inputs'!B4","v":"2018-03-31"},{"$f":"DATE(YEAR(B5)+1,MONTH(B5),DAY(B5))","v":"2019-03-31"},{"$f":"DATE(YEAR(C5)+1,MONTH(C5),DAY(C5))","v":"2020-03-31"},"2021-03-31","2022-03-31","2023-03-31","2024-03-31","2025-03-31","2026-03-31","2027-03-31","2028-03-31"]
[]
["Assets:","t0","t1","t2","t3","t4","t5","t6","t7","t8","t9","t10"]
["Cash and cash equivalents",{"$f":"'Loan and Cash Flow Accounts'!B45+'Loan and Cash Flow Accounts'!B50","v":0},{"$f":"'Loan and Cash Flow Accounts'!C45+'Loan and Cash Flow Accounts'!C50","v":0},{"$f":"'Loan and Cash Flow Accounts'!D45+'Loan and Cash Flow Accounts'!D50","v":0},{"$f":"'Loan and Cash Flow Accounts'!E45+'Loan and Cash Flow Accounts'!E50","v":0},{"$f":"'Loan and Cash Flow Accounts'!F45+'Loan and Cash Flow Accounts'!F50","v":0},{"$f":"'Loan and Cash Flow Accounts'!G45+'Loan and Cash Flow Accounts'!G50","v":0},{"$f":"'Loan and Cash Flow Accounts'!H45+'Loan and Cash Flow Accounts'!H50","v":0},{"$f":"'Loan and Cash Flow Accounts'!I45+'Loan and Cash Flow Accounts'!I50","v":0},{"$f":"'Loan and Cash Flow Accounts'!J45+'Loan and Cash Flow Accounts'!J50","v":0},{"$f":"'Loan and Cash Flow Accounts'!K45+'Loan and Cash Flow Accounts'!K50","v":0},{"$f":"'Loan and Cash Flow Accounts'!L45+'Loan and Cash Flow Accounts'!L50","v":0}]
{"$rows_left_out":57}
{"sheet":"Capital","index":6,"n_rows":104,"n_cols":103,"rows_kept":104,"cut":false,"hidden":false,"merged":[[5,3,5,12],[1,0,1,1]]}
["This sheet contains:  Results of capital calculation through time and the computation of the risk-based capital requirement"]
["Instructions: None -- Run Solver from this sheet.  Sheet must be unprotected to run the Solver command.  Before running solver, work through each sheet in the following order: (1) data entry,  (2) assumptions and relationships, and  (3) risk measures.  After completing the required inputs in these sheets, the solver function can then be run.",null,null,null,null,null,null,null,null,null,null,null,null,null,null,{"$f":"HLOOKUP(A5,Q3:CM4,2,0)","v":{"$error":"#N/A"}}]
[null,null,null,null,null,null,null,null,null,null,null,null,null,null,null,"date range",{"$f":"'Data Inputs'!D4","v":"1999-06-30"},{"$f":"'Data Inputs'!E4","v":"1999-09-30"},{"$f":"'Data Inputs'!F4","v":"1999-12-31"},{"$f":"'Data Inputs'!G4","v":"2000-03-31"},{"$f":"'Data Inputs'!H4","v":"2000-06-30"},{"$f":"'Data Inputs'!I4","v":"2000-09-30"},{"$f":"'Data Inputs'!J4","v":"2000-12-31"},{"$f":"'Data Inputs'!K4","v":"2001-03-31"},{"$f":"'Data Inputs'!L4","v":"2001-06-30"},{"$f":"'Data Inputs'!M4","v":"2001-09-30"},{"$f":"'Data Inputs'!N4","v":"2001-12-31"},{"$f":"'Data Inputs'!O4","v":"2002-03-31"},{"$f":"'Data Inputs'!P4","v":"2002-06-30"},{"$f":"'Data Inputs'!Q4","v":"2002-09-30"},{"$f":"'Data Inputs'!R4","v":"2002-12-31"},{"$f":"'Data Inputs'!S4","v":"2003-03-31"},{"$f":"'Data Inputs'!T4","v":"2003-06-30"},{"$f":"'Data Inputs'!U4","v":"2003-09-30"},{"$f":"'Data Inputs'!V4","v":"2003-12-31"},{"$f":"'Data Inputs'!W4","v":"2004-03-31"},{"$f":"'Data Inputs'!X4","v":"2004-06-30"},{"$f":"'Data Inputs'!Y4","v":"2004-09-30"},{"$f":"'Data Inputs'!Z4","v":"2004-12-31"},{"$f":"'Data Inputs'!AA4","v":"2005-03-31"},{"$f":"'Data Inputs'!AB4","v":"2005-06-30"},{"$f":"'Data Inputs'!AC4","v":"2005-09-30"},{"$f":"'Data Inputs'!AD4","v":"2005-12-31"},{"$f":"'Data Inputs'!AE4","v":"2006-03-31"},{"$f":"'Data Inputs'!AF4","v":"2006-06-30"},{"$f":"'Data Inputs'!AG4","v":"2006-09-30"},{"$f":"'Data Inputs'!AH4","v":"2006-12-31"},{"$f":"'Data Inputs'!AI4","v":"2007-03-31"},{"$f":"'Data Inputs'!AJ4","v":"2007-06-30"},{"$f":"'Data Inputs'!AK4","v":"2007-09-30"},{"$f":"'Data Inputs'!AL4","v":"2007-12-31"},{"$f":"'Data Inputs'!AM4","v":"2008-03-31"},{"$f":"'Data Inputs'!AN4","v":"2008-06-30"},{"$f":"'Data Inputs'!AO4","v":"2008-09-30"},{"$f":"'Data Inputs'!AP4","v":"2008-12-31"},{"$f":"'Data Inputs'!AQ4","v":"2009-03-31"},{"$f":"'Data Inputs'!AR4","v":"2009-06-30"},{"$f":"'Data Inputs'!AS4","v":"2009-09-30"},{"$f":"'Data Inputs'!AT4","v":"2009-12-31"},{"$f":"'Data Inputs'!AU4","v":"2010-03-31"},{"$f":"'Data Inputs'!AV4","v":"2010-06-30"},{"$f":"'Data Inputs'!AW4","v":"2010-09-30"},{"$f":"'Data Inputs'!AX4","v":"2010-12-31"},{"$f":"'Data Inputs'!AY4","v":"2011-03-31"},{"$f":"'Data Inputs'!AZ4","v":"2011-06-30"},{"$f":"'Data Inputs'!BA4","v":"2011-09-30"},{"$f":"'Data Inputs'!BB4","v":"2011-12-31"},{"$f":"'Data Inputs'!BC4","v":"2012-03-31"},{"$f":"'Data Inputs'!BD4","v":"2012-06-30"},{"$f":"'Data Inputs'!BE4","v":"2012-09-30"},{"$f":"'Data Inputs'!BF4","v":"2012-12-31"},{"$f":"'Data Inputs'!BG4","v":"2013-03-31"},{"$f":"'Data Inputs'!BH4","v":"2013-06-30"},{"$f":"'Data Inputs'!BI4","v":"2013-09-30"},{"$f":"'Data Inputs'!BJ4","v":"2013-12-31"},{"$f":"'Data Inputs'!BK4","v":"2014-03-31"},{"$f":"'Data Inputs'!BL4","v":"2014-06-30"},{"$f":"'Data Inputs'!BM4","v":"2014-09-30"},{"$f":"'Data Inputs'!BN4","v":"2014-12-31"},{"$f":"'Data Inputs'!BO4","v":"2015-03-31"},"2015-06-30","2015-09-30","2015-12-31","2016-03-31","2016-06-30","2016-09-30","2016-12-31","2017-03-31","2017-06-30","2017-09-30","2017-12-31","2018-03-31","2018-06-30","2018-09-30","2018-12-31","2019-03-31","2019-06-30","2019-09-30","2019-12-31","2020-03-31","2020-06-30","2020-09-30","2020-12-31"]
["Select Date of Analysis",null,null,null,null,null,null,null,null,null,null,null,null,null,null,null,{"$f":"'Data Inputs'!D3","v":1},{"$f":"'Data Inputs'!E3","v":2},{"$f":"'Data Inputs'!F3","v":3},{"$f":"'Data Inputs'!G3","v":4},{"$f":"'Data Inputs'!H3","v":5},{"$f":"'Data Inputs'!I3","v":6},{"$f":"'Data Inputs'!J3","v":7},{"$f":"'Data Inputs'!K3","v":8},{"$f":"'Data Inputs'!L3","v":9},{"$f":"'Data Inputs'!M3","v":10},{"$f":"'Data Inputs'!N3","v":11},{"$f":"'Data Inputs'!O3","v":12},{"$f":"'Data Inputs'!P3","v":13},{"$f":"'Data Inputs'!Q3","v":14},{"$f":"'Data Inputs'!R3","v":15},{"$f":"'Data Inputs'!S3","v":16},{"$f":"'Data Inputs'!T3","v":17},{"$f":"'Data Inputs'!U3","v":18},{"$f":"'Data Inputs'!V3","v":19},{"$f":"'Data Inputs'!W3","v":20},{"$f":"'Data Inputs'!X3","v":21},{"$f":"'Data Inputs'!Y3","v":22},{"$f":"'Data Inputs'!Z3","v":23},{"$f":"'Data Inputs'!AA3","v":24},{"$f":"'Data Inputs'!AB3","v":25},{"$f":"'Data Inputs'!AC3","v":26},{"$f":"'Data Inputs'!AD3","v":27},{"$f":"'Data Inputs'!AE3","v":28},{"$f":"'Data Inputs'!AF3","v":29},{"$f":"'Data Inputs'!AG3","v":30},{"$f":"'Data Inputs'!AH3","v":31},{"$f":"'Data Inputs'!AI3","v":32},{"$f":"'Data Inputs'!AJ3","v":33},{"$f":"'Data Inputs'!AK3","v":34},{"$f":"'Data Inputs'!AL3","v":35},{"$f":"'Data Inputs'!AM3","v":36},{"$f":"'Data Inputs'!AN3","v":37},{"$f":"'Data Inputs'!AO3","v":38},{"$f":"'Data Inputs'!AP3","v":39},{"$f":"'Data Inputs'!AQ3","v":40},{"$f":"'Data Inputs'!AR3","v":41},{"$f":"'Data Inputs'!AS3","v":42},{"$f":"'Data Inputs'!AT3","v":43},{"$f":"'Data Inputs'!AU3","v":44},{"$f":"'Data Inputs'!AV3","v":45},{"$f":"'Data Inputs'!AW3","v":46},{"$f":"'Data Inputs'!AX3","v":47},{"$f":"'Data Inputs'!AY3","v":48},{"$f":"'Data Inputs'!AZ3","v":49},{"$f":"'Data Inputs'!BA3","v":50},{"$f":"'Data Inputs'!BB3","v":51},{"$f":"'Data Inputs'!BC3","v":52},{"$f":"'Data Inputs'!BD3","v":53},{"$f":"'Data Inputs'!BE3","v":54},{"$f":"'Data Inputs'!BF3","v":55},{"$f":"'Data Inputs'!BG3","v":56},{"$f":"'Data Inputs'!BH3","v":57},{"$f":"'Data Inputs'!BI3","v":58},{"$f":"'Data Inputs'!BJ3","v":59},{"$f":"'Data Inputs'!BK3","v":60},{"$f":"'Data Inputs'!BL3","v":61},{"$f":"'Data Inputs'!BM3","v":62},{"$f":"'Data Inputs'!BN3","v":63},{"$f":"'Data Inputs'!BO3","v":64},65,66,67,68,69,70,71,72,73,74,75,76,77,78,79,80,81,82,83,84,85,86,87]
["2018-03-31","(moved from A&R for convenience)"]
[null,null,"Initial Capital"," Proforma Capital Positions"]
[null,null,{"$f":"'Balance Sheets'!B5","v":"2018-03-31"},{"$f":"'Balance Sheets'!C5","v":"2019-03-31"},{"$f":"'Balance Sheets'!D5","v":"2020-03-31"},{"$f":"'Balance Sheets'!E5","v":"2021-03-31"},{"$f":"'Balance Sheets'!F5","v":"2022-03-31"},{"$f":"'Balance Sheets'!G5","v":"2023-03-31"},{"$f":"'Balance Sheets'!H5","v":"2024-03-31"},{"$f":"'Balance Sheets'!I5","v":"2025-03-31"},{"$f":"'Balance Sheets'!J5","v":"2026-03-31"},{"$f":"'Balance Sheets'!K5","v":"2027-03-31"},{"$f":"'Balance Sheets'!L5","v":"2028-03-31"}]
["I. Regulatory Capital",null,"t0","t1","t2","t3","t4","t5","t6","t7","t8","t9","t10"]
{"$rows_left_out":96}